{"text_format":"1","workbook":"xlsx","n_sheets":3,"sheets":["Comunicação de contratos","Dados","Erros"],"not_rendered":{"charts":0,"images":0,"macros":0,"external_links":0,"defined_names":7,"comments":0,"pivot_tables":0},"unopened":[],"bounds":{"document_bytes":16777216,"sheet_cells":100000,"rows_first":2000,"rows_last":500,"rows_between":2000,"halvings":0,"cell_chars":16384,"cell_head_chars":4096},"cells_cut":0,"cells_raw":0,"read":"whole","date_system":"1900"}

{"sheet":"Comunicação de contratos","index":0,"n_rows":52,"n_cols":41,"rows_kept":52,"cut":false,"hidden":false,"merged":[[42,2,42,3],[45,2,45,3],[46,2,46,3],[45,4,45,6],[39,4,39,6],[42,4,42,6],[17,27,17,28],[17,18,17,19],[17,22,17,23],[17,13,17,14],[36,4,36,6],[36,2,36,3],[31,4,31,6],[31,2,31,3],[30,4,30,6],[30,2,30,3],[32,2,32,3],[35,2,35,3],[28,2,28,3],[33,2,33,3],[34,2,34,3],[29,2,29,3],[6,0,10,0],[27,4,27,6],[26,4,26,6],[22,4,22,6],[24,4,24,6],[25,4,25,6],[20,4,20,6],[17,16,18,16],[15,0,18,0],[17,12,18,12],[25,2,25,3],[26,2,26,3],[27,2,27,3],[21,2,21,3],[22,2,22,3],[23,2,23,3],[24,2,24,3],[15,7,16,9],[15,37,18,37],[19,2,19,3],[20,2,20,3],[17,39,17,41],[7,39,7,40],[51,33,51,36],[17,24,18,24],[17,25,18,25],[15,35,17,36],[17,32,18,32],[17,30,18,30],[15,30,16,32],[15,33,17,34],[17,31,18,31],[50,1,50,36],[21,4,21,6],[19,4,19,6],[23,4,23,6],[17,21,18,21],[17,26,18,26],[16,11,16,21],[17,11,18,11],[16,22,16,26],[49,1,49,11],[48,2,48,3],[47,2,47,3],[48,4,48,6],[39,2,39,3],[40,2,40,3],[41,2,41,3],[47,4,47,6],[28,4,28,6],[40,4,40,6],[29,4,29,6],[38,4,38,6],[32,4,32,6],[33,4,33,6],[41,4,41,6],[37,4,37,6],[44,4,44,6],[34,4,34,6],[35,4,35,6],[37,2,37,3],[38,2,38,3],[46,4,46,6],[43,4,43,6],[43,2,43,3],[44,2,44,3],[6,37,10,37],[0,1,0,36],[15,2,16,6],[17,4,18,6],[17,7,18,7],[17,8,18,8],[17,20,18,20],[5,1,5,36],[1,1,1,36],[7,2,7,3],[9,2,9,3],[11,1,11,36],[13,1,13,36],[17,17,18,17],[17,15,18,15],[16,29,18,29],[15,11,15,29],[15,1,18,1],[7,7,7,36],[9,5,9,36],[3,5,3,7],[17,2,18,3],[17,9,18,9],[17,10,18,10]]}
[null,"Comunicação de contratos de aquisição de serviços - Artigo 75.º, n.º 14, da LEO 2015 e art.º 4.º da Portaria n.º 20/2015, de 4 de Fevereiro"]
[null,"Identificação do processo  (a preencher por contratação de serviços)"]
[]
[null,"Nº Processo",null,"/C/2015","Data"]
[]
[null,"Caraterização do Serviço"]
[]
[null,"Cod. SIOE",null,null,"Ministério",null,null,{"$f":"IF(F8=\"\",\"\",VLOOKUP(F8,Dados!$Z$2:$AA$30,2,0))","v":""},null,null,null,null,null,null,null,null,null,null,null,null,null,null,null,null,null,null,null,null,null,null,null,null,null,null,null,null,null,null,null,"Reversão"]
[]
[null,"NIPC",null,null,"Serviço",null,null,null,null,null,null,null,null,null,null,null,null,null,null,null,null,null,null,null,null,null,null,null,null,null,null,null,null,null,null,null,null,null,null,"Ano","Valor"]
[]
[null,"Despacho",null,null,null,null,null,null,null,null,null,null,null,null,null,null,null,null,null,null,null,null,null,null,null,null,null,null,null,null,null,null,null,null,null,null,null,null,null,2015,0.2]
[]
[]
[]
{"$rows_left_out":38}
{"sheet":"Dados","index":1,"n_rows":30,"n_cols":33,"rows_kept":30,"cut":false,"hidden":true,"merged":[]}
["Modalidade contratual",null,null,"Tipo de atividade",null,null,"Área de atividade",null,null,"Não aplicável",null,null,"Tipo",null,null,"Tipo",null,null,"Situação tipo",null,null,"Declaração de incompatibilidades/impedimentos",null,null,"Ministérios",null,null,null,"Incompatibilidade",null,null,"Tipo Contrato"]
[null,"Avença",null,null,"Assistência / manutenção",null,null,"Ambiente",null,null,"Já foi objeto de redução no ano anterior",null,null,"Ajuste direto",null,null,"Pessoa coletiva",null,null,"Ação de Formação (<= 132 horas)",null,null,"Sim",null,null,"-","-",null,null,"Não há relação/participação de ex-colaboradores, cônjuge, parente ou afim em linha reta ou até 2º grau da linha colateral ou de qualquer pessoa com quem viva",null,null,"Celebração"]
[null,"Tarefa",null,null,"Consultadoria técnica",null,null,"Animação cultural, recreativa, turística",null,null,"Não atinge o montante mínimo para redução",null,null,"Ajuste direto simplificado",null,null,"Pessoa singular",null,null,"Prestação de Serviço de execução (até 20 dias)",null,null,"Não ",null,null,"MAI","Ministério da Administração Interna",null,null,"Há relação/participação de ex-colaboradores, cônjuge, parente ou afim em linha reta ou até 2º grau da linha colateral ou de qualquer pessoa com quem viva em economia comum",null,null,"Renovação"]
[null,"Outras aquisições de serviços",null,null,"Outro",null,null,"Arquitetura",null,null,"Não existiu contrato anterior",null,null,null,null,null,"Sociedade unipessoal",null,null,"Manutenção/Assistência Técnica a máquinas, equipamentos ou instalações",null,null,null,null,null,"MAM","Ministério da Agricultura e do Mar"]
[null,null,null,null,null,null,null,"Assessoria económica e ou financeira",null,null,null,null,null,null,null,null,null,null,null,null,null,null,null,null,null,"MAM/MAOTE","Ministério da Agricultura e do Mar/Ministério do Ambiente, Ordenamento do Território e Energia"]
[null,null,null,null,null,null,null,"Comunicação",null,null,null,null,null,null,null,null,null,null,null,null,null,null,null,null,null,"MAOTE","Ministério do Ambiente, Ordenamento do Território e Energia"]
[null,null,null,null,null,null,null,"Contabilidade",null,null,null,null,null,null,null,null,null,null,null,null,null,null,null,null,null,"MAOTE/MAM","Ministério do Ambiente, Ordenamento do Território e Energia/Ministério da Agricultura e do Mar"]
[null,null,null,null,null,null,null,"Design",null,null,null,null,null,null,null,null,null,null,null,null,null,null,null,null,null,"MDN","Ministério da Defesa Nacional"]
[null,null,null,null,null,null,null,"Engenharia",null,null,null,null,null,null,null,null,null,null,null,null,null,null,null,null,null,"MDN/MDN","Ministério da Defesa Nacional/Ministério da Defesa Nacional"]
[null,null,null,null,null,null,null,"Formação",null,null,null,null,null,null,null,null,null,null,null,null,null,null,null,null,null,"ME","Ministério da Economia"]
[null,null,null,null,null,null,null,"Gestão",null,null,null,null,null,null,null,null,null,null,null,null,null,null,null,null,null,"ME/MAM","Ministério da Economia/Ministério da Agricultura e do Mar"]
[null,null,null,null,null,null,null,"Higiene e limpeza",null,null,null,null,null,null,null,null,null,null,null,null,null,null,null,null,null,"ME/MEC","Ministério da Economia/Ministério da Educação e Ciência"]
[null,null,null,null,null,null,null,"Informática",null,null,null,null,null,null,null,null,null,null,null,null,null,null,null,null,null,"MEC","Ministério da Educação e Ciência"]
[null,null,null,null,null,null,null,"Jurídica",null,null,null,null,null,null,null,null,null,null,null,null,null,null,null,null,null,"MEC/ME/MSESS","Ministério da Educação e Ciência/Ministério da Economia/Ministério da Solidariedade, Emprego e Segurança Social"]
[null,null,null,null,null,null,null,"Máquinas, equipamentos ou instalações",null,null,null,null,null,null,null,null,null,null,null,null,null,null,null,null,null,"MEC/MF","Ministério da Educação e Ciência/Ministério das Finanças"]
{"$rows_left_out":16}
{"sheet":"Erros","index":2,"n_rows":31,"n_cols":17,"rows_kept":31,"cut":false,"hidden":false,"merged":[]}
["Nº de Erros","n.º da Linha","Nº Contrato",null,"Campos por preencher",null,"1-Modalidade de relação contratual",null,"2-Valor  global contratual novo (s/iva)",null,"3-Percentagem redução  global aplicada",null,"4-Valor mensal contratual novo (s/iva)",null,"5-Percentagem redução mensal aplicada",null,"6-Total anual prestador"]
[{"$f":"SUM(D2:Q2)","v":0},{"$f":"IF(A2>0,ROW('Comunicação de contratos'!B20),\"\")","v":""},{"$f":"'Comunicação de contratos'!B20","v":""},{"$f":"IF(E2=\"\",0,1)","v":0},{"$f":"IF('Comunicação de contratos'!AO20=\"Incompleto\",\"Existem campos por preencher\",\"\")","v":""},{"$f":"IF(G2=\"\",0,1)","v":0},{"$f":"IF(AND('Comunicação de contratos'!C20=\"Outras prestações de serviços\",'Comunicação de contratos'!E20=\"\"),\"Modalidade Contratual não identificada\",\"\")","v":""},{"$f":"IF(I2=\"\",0,1)","v":0},{"$f":"IF('Comunicação de contratos'!P20>5000,\"O valor global é superior a 5 000,00€\",\"\")","v":""},{"$f":"IF(K2=\"\",0,1)","v":0},{"$f":"IF('Comunicação de contratos'!P20<=1500,\"\",IF('Comunicação de contratos'!R20<'Comunicação de contratos'!T20,\"Redução global não foi verificada\",\"\"))","v":""},{"$f":"IF(M2=\"\",0,1)","v":0},{"$f":"IF('Comunicação de contratos'!Y20>5000,\"O valor Mensal é superior a 5 000,00€\",\"\")","v":""},{"$f":"IF(O2=\"\",0,1)","v":0},{"$f":"IF('Comunicação de contratos'!Y20<=1500,\"\",IF('Comunicação de contratos'!AA20<'Comunicação de contratos'!AC20,\"Redução mensal não verificada\",\"\"))","v":""},{"$f":"IF(Q2=\"\",0,1)","v":0},{"$f":"IF('Comunicação de contratos'!U20>5000,\"O valor total anual prestador é superior a 5 000,00€\",\"\")","v":""}]
[{"$f":"SUM(D3:Q3)","v":0},{"$f":"IF(A3>0,ROW('Comunicação de contratos'!B21),\"\")","v":""},{"$f":"'Comunicação de contratos'!B21","v":""},{"$f":"IF(E3=\"\",0,1)","v":0},{"$f":"IF('Comunicação de contratos'!AO21=\"Incompleto\",\"Existem campos por preencher\",\"\")","v":""},{"$f":"IF(G3=\"\",0,1)","v":0},{"$f":"IF(AND('Comunicação de contratos'!C21=\"Outras prestações de serviços\",'Comunicação de contratos'!E21=\"\"),\"Modalidade Contratual não identificada\",\"\")","v":""},{"$f":"IF(I3=\"\",0,1)","v":0},{"$f":"IF('Comunicação de contratos'!P21>5000,\"O valor global é superior a 5 000,00€\",\"\")","v":""},{"$f":"IF(K3=\"\",0,1)","v":0},{"$f":"IF('Comunicação de contratos'!P21<=1500,\"\",IF('Comunicação de contratos'!R21<'Comunicação de contratos'!T21,\"Redução global não foi verificada\",\"\"))","v":""},{"$f":"IF(M3=\"\",0,1)","v":0},{"$f":"IF('Comunicação de contratos'!Y21>5000,\"O valor Mensal é superior a 5 000,00€\",\"\")","v":""},{"$f":"IF(O3=\"\",0,1)","v":0},{"$f":"IF('Comunicação de contratos'!Y21<=1500,\"\",IF('Comunicação de contratos'!AA21<'Comunicação de contratos'!AC21,\"Redução mensal não verificada\",\"\"))","v":""},{"$f":"IF(Q3=\"\",0,1)","v":0},{"$f":"IF('Comunicação de contratos'!U21>5000,\"O valor total anual prestador é superior a 5 000,00€\",\"\")","v":""}]
[0,{"$f":"IF(A4>0,ROW('Comunicação de contratos'!B22),\"\")","v":""},{"$f":"'Comunicação de contratos'!B22","v":""},0,{"$f":"IF('Comunicação de contratos'!AO22=\"Incompleto\",\"Existem campos por preencher\",\"\")","v":""},0,{"$f":"IF(AND('Comunicação de contratos'!C22=\"Outras prestações de serviços\",'Comunicação de contratos'!E22=\"\"),\"Modalidade Contratual não identificada\",\"\")","v":""},0,{"$f":"IF('Comunicação de contratos'!P22>5000,\"O valor global é superior a 5 000,00€\",\"\")","v":""},0,{"$f":"IF('Comunicação de contratos'!P22<=1500,\"\",IF('Comunicação de contratos'!R22<'Comunicação de contratos'!T22,\"Redução global não foi verificada\",\"\"))","v":""},0,{"$f":"IF('Comunicação de contratos'!Y22>5000,\"O valor Mensal é superior a 5 000,00€\",\"\")","v":""},0,{"$f":"IF('Comunicação de contratos'!Y22<=1500,\"\",IF('Comunicação de contratos'!AA22<'Comunicação de contratos'!AC22,\"Redução mensal não verificada\",\"\"))","v":""},0,{"$f":"IF('Comunicação de contratos'!U22>5000,\"O valor total anual prestador é superior a 5 000,00€\",\"\")","v":""}]
[0,{"$f":"IF(A5>0,ROW('Comunicação de contratos'!B23),\"\")","v":""},{"$f":"'Comunicação de contratos'!B23","v":""},0,{"$f":"IF('Comunicação de contratos'!AO23=\"Incompleto\",\"Existem campos por preencher\",\"\")","v":""},0,{"$f":"IF(AND('Comunicação de contratos'!C23=\"Outras prestações de serviços\",'Comunicação de contratos'!E23=\"\"),\"Modalidade Contratual não identificada\",\"\")","v":""},0,{"$f":"IF('Comunicação de contratos'!P23>5000,\"O valor global é superior a 5 000,00€\",\"\")","v":""},0,{"$f":"IF('Comunicação de contratos'!P23<=1500,\"\",IF('Comunicação de contratos'!R23<'Comunicação de contratos'!T23,\"Redução global não foi verificada\",\"\"))","v":""},0,{"$f":"IF('Comunicação de contratos'!Y23>5000,\"O valor Mensal é superior a 5 000,00€\",\"\")","v":""},0,{"$f":"IF('Comunicação de contratos'!Y23<=1500,\"\",IF('Comunicação de contratos'!AA23<'Comunicação de contratos'!AC23,\"Redução mensal não verificada\",\"\"))","v":""},0,{"$f":"IF('Comunicação de contratos'!U23>5000,\"O valor total anual prestador é superior a 5 000,00€\",\"\")","v":""}]
[0,{"$f":"IF(A6>0,ROW('Comunicação de contratos'!B24),\"\")","v":""},{"$f":"'Comunicação de contratos'!B24","v":""},0,{"$f":"IF('Comunicação de contratos'!AO24=\"Incompleto\",\"Existem campos por preencher\",\"\")","v":""},0,{"$f":"IF(AND('Comunicação de contratos'!C24=\"Outras prestações de serviços\",'Comunicação de contratos'!E24=\"\"),\"Modalidade Contratual não identificada\",\"\")","v":""},0,{"$f":"IF('Comunicação de contratos'!P24>5000,\"O valor global é superior a 5 000,00€\",\"\")","v":""},0,{"$f":"IF('Comunicação de contratos'!P24<=1500,\"\",IF('Comunicação de contratos'!R24<'Comunicação de contratos'!T24,\"Redução global não foi verificada\",\"\"))","v":""},0,{"$f":"IF('Comunicação de contratos'!Y24>5000,\"O valor Mensal é superior a 5 000,00€\",\"\")","v":""},0,{"$f":"IF('Comunicação de contratos'!Y24<=1500,\"\",IF('Comunicação de contratos'!AA24<'Comunicação de contratos'!AC24,\"Redução mensal não verificada\",\"\"))","v":""},0,{"$f":"IF('Comunicação de contratos'!U24>5000,\"O valor total anual prestador é superior a 5 000,00€\",\"\")","v":""}]
[0,{"$f":"IF(A7>0,ROW('Comunicação de contratos'!B25),\"\")","v":""},{"$f":"'Comunicação de contratos'!B25","v":""},0,{"$f":"IF('Comunicação de contratos'!AO25=\"Incompleto\",\"Existem campos por preencher\",\"\")","v":""},0,{"$f":"IF(AND('Comunicação de contratos'!C25=\"Outras prestações de serviços\",'Comunicação de contratos'!E25=\"\"),\"Modalidade Contratual não identificada\",\"\")","v":""},0,{"$f":"IF('Comunicação de contratos'!P25>5000,\"O valor global é superior a 5 000,00€\",\"\")","v":""},0,{"$f":"IF('Comunicação de contratos'!P25<=1500,\"\",IF('Comunicação de contratos'!R25<'Comunicação de contratos'!T25,\"Redução global não foi verificada\",\"\"))","v":""},0,{"$f":"IF('Comunicação de contratos'!Y25>5000,\"O valor Mensal é superior a 5 000,00€\",\"\")","v":""},0,{"$f":"IF('Comunicação de contratos'!Y25<=1500,\"\",IF('Comunicação de contratos'!AA25<'Comunicação de contratos'!AC25,\"Redução mensal não verificada\",\"\"))","v":""},0,{"$f":"IF('Comunicação de contratos'!U25>5000,\"O valor total anual prestador é superior a 5 000,00€\",\"\")","v":""}]
[0,{"$f":"IF(A8>0,ROW('Comunicação de contratos'!B26),\"\")","v":""},{"$f":"'Comunicação de contratos'!B26","v":""},0,{"$f":"IF('Comunicação de contratos'!AO26=\"Incompleto\",\"Existem campos por preencher\",\"\")","v":""},0,{"$f":"IF(AND('Comunicação de contratos'!C26=\"Outras prestações de serviços\",'Comunicação de contratos'!E26=\"\"),\"Modalidade Contratual não identificada\",\"\")","v":""},0,{"$f":"IF('Comunicação de contratos'!P26>5000,\"O valor global é superior a 5 000,00€\",\"\")","v":""},0,{"$f":"IF('Comunicação de contratos'!P26<=1500,\"\",IF('Comunicação de contratos'!R26<'Comunicação de contratos'!T26,\"Redução global não foi verificada\",\"\"))","v":""},0,{"$f":"IF('Comunicação de contratos'!Y26>5000,\"O valor Mensal é superior a 5 000,00€\",\"\")","v":""},0,{"$f":"IF('Comunicação de contratos'!Y26<=1500,\"\",IF('Comunicação de contratos'!AA26<'Comunicação de contratos'!AC26,\"Redução mensal não verificada\",\"\"))","v":""},0,{"$f":"IF('Comunicação de contratos'!U26>5000,\"O valor total anual prestador é superior a 5 000,00€\",\"\")","v":""}]
[0,{"$f":"IF(A9>0,ROW('Comunicação de contratos'!B27),\"\")","v":""},{"$f":"'Comunicação de contratos'!B27","v":""},0,{"$f":"IF('Comunicação de contratos'!AO27=\"Incompleto\",\"Existem campos por preencher\",\"\")","v":""},0,{"$f":"IF(AND('Comunicação de contratos'!C27=\"Outras prestações de serviços\",'Comunicação de contratos'!E27=\"\"),\"Modalidade Contratual não identificada\",\"\")","v":""},0,{"$f":"IF('Comunicação de contratos'!P27>5000,\"O valor global é superior a 5 000,00€\",\"\")","v":""},0,{"$f":"IF('Comunicação de contratos'!P27<=1500,\"\",IF('Comunicação de contratos'!R27<'Comunicação de contratos'!T27,\"Redução global não foi verificada\",\"\"))","v":""},0,{"$f":"IF('Comunicação de contratos'!Y27>5000,\"O valor Mensal é superior a 5 000,00€\",\"\")","v":""},0,{"$f":"IF('Comunicação de contratos'!Y27<=1500,\"\",IF('Comunicação de contratos'!AA27<'Comunicação de contratos'!AC27,\"Redução mensal não verificada\",\"\"))","v":""},0,{"$f":"IF('Comunicação de contratos'!U27>5000,\"O valor total anual prestador é superior a 5 000,00€\",\"\")","v":""}]
[0,{"$f":"IF(A10>0,ROW('Comunicação de contratos'!B28),\"\")","v":""},{"$f":"'Comunicação de contratos'!B28","v":""},0,{"$f":"IF('Comunicação de contratos'!AO28=\"Incompleto\",\"Existem campos por preencher\",\"\")","v":""},0,{"$f":"IF(AND('Comunicação de contratos'!C28=\"Outras prestações de serviços\",'Comunicação de contratos'!E28=\"\"),\"Modalidade Contratual não identificada\",\"\")","v":""},0,{"$f":"IF('Comunicação de contratos'!P28>5000,\"O valor global é superior a 5 000,00€\",\"\")","v":""},0,{"$f":"IF('Comunicação de contratos'!P28<=1500,\"\",IF('Comunicação de contratos'!R28<'Comunicação de contratos'!T28,\"Redução global não foi verificada\",\"\"))","v":""},0,{"$f":"IF('Comunicação de contratos'!Y28>5000,\"O valor Mensal é superior a 5 000,00€\",\"\")","v":""},0,{"$f":"IF('Comunicação de contratos'!Y28<=1500,\"\",IF('Comunicação de contratos'!AA28<'Comunicação de contratos'!AC28,\"Redução mensal não verificada\",\"\"))","v":""},0,{"$f":"IF('Comunicação de contratos'!U28>5000,\"O valor total anual prestador é superior a 5 000,00€\",\"\")","v":""}]
[0,{"$f":"IF(A11>0,ROW('Comunicação de contratos'!B29),\"\")","v":""},{"$f":"'Comunicação de contratos'!B29","v":""},0,{"$f":"IF('Comunicação de contratos'!AO29=\"Incompleto\",\"Existem campos por preencher\",\"\")","v":""},0,{"$f":"IF(AND('Comunicação de contratos'!C29=\"Outras prestações de serviços\",'Comunicação de contratos'!E29=\"\"),\"Modalidade Contratual não identificada\",\"\")","v":""},0,{"$f":"IF('Comunicação de contratos'!P29>5000,\"O valor global é superior a 5 000,00€\",\"\")","v":""},0,{"$f":"IF('Comunicação de contratos'!P29<=1500,\"\",IF('Comunicação de contratos'!R29<'Comunicação de contratos'!T29,\"Redução global não foi verificada\",\"\"))","v":""},0,{"$f":"IF('Comunicação de contratos'!Y29>5000,\"O valor Mensal é superior a 5 000,00€\",\"\")","v":""},0,{"$f":"IF('Comunicação de contratos'!Y29<=1500,\"\",IF('Comunicação de contratos'!AA29<'Comunicação de contratos'!AC29,\"Redução mensal não verificada\",\"\"))","v":""},0,{"$f":"IF('Comunicação de contratos'!U29>5000,\"O valor total anual prestador é superior a 5 000,00€\",\"\")","v":""}]
[0,{"$f":"IF(A12>0,ROW('Comunicação de contratos'!B30),\"\")","v":""},{"$f":"'Comunicação de contratos'!B30","v":""},0,{"$f":"IF('Comunicação de contratos'!AO30=\"Incompleto\",\"Existem campos por preencher\",\"\")","v":""},0,{"$f":"IF(AND('Comunicação de contratos'!C30=\"Outras prestações de serviços\",'Comunicação de contratos'!E30=\"\"),\"Modalidade Contratual não identificada\",\"\")","v":""},0,{"$f":"IF('Comunicação de contratos'!P30>5000,\"O valor global é superior a 5 000,00€\",\"\")","v":""},0,{"$f":"IF('Comunicação de contratos'!P30<=1500,\"\",IF('Comunicação de contratos'!R30<'Comunicação de contratos'!T30,\"Redução global não foi verificada\",\"\"))","v":""},0,{"$f":"IF('Comunicação de contratos'!Y30>5000,\"O valor Mensal é superior a 5 000,00€\",\"\")","v":""},0,{"$f":"IF('Comunicação de contratos'!Y30<=1500,\"\",IF('Comunicação de contratos'!AA30<'Comunicação de contratos'!AC30,\"Redução mensal não verificada\",\"\"))","v":""},0,{"$f":"IF('Comunicação de contratos'!U30>5000,\"O valor total anual prestador é superior a 5 000,00€\",\"\")","v":""}]
[0,{"$f":"IF(A13>0,ROW('Comunicação de contratos'!B31),\"\")","v":""},{"$f":"'Comunicação de contratos'!B31","v":""},0,{"$f":"IF('Comunicação de contratos'!AO31=\"Incompleto\",\"Existem campos por preencher\",\"\")","v":""},0,{"$f":"IF(AND('Comunicação de contratos'!C31=\"Outras prestações de serviços\",'Comunicação de contratos'!E31=\"\"),\"Modalidade Contratual não identificada\",\"\")","v":""},0,{"$f":"IF('Comunicação de contratos'!P31>5000,\"O valor global é superior a 5 000,00€\",\"\")","v":""},0,{"$f":"IF('Comunicação de contratos'!P31<=1500,\"\",IF('Comunicação de contratos'!R31<'Comunicação de contratos'!T31,\"Redução global não foi verificada\",\"\"))","v":""},0,{"$f":"IF('Comunicação de contratos'!Y31>5000,\"O valor Mensal é superior a 5 000,00€\",\"\")","v":""},0,{"$f":"IF('Comunicação de contratos'!Y31<=1500,\"\",IF('Comunicação de contratos'!AA31<'Comunicação de contratos'!AC31,\"Redução mensal não verificada\",\"\"))","v":""},0,{"$f":"IF('Comunicação de contratos'!U31>5000,\"O valor total anual prestador é superior a 5 000,00€\",\"\")","v":""}]
[0,{"$f":"IF(A14>0,ROW('Comunicação de contratos'!B32),\"\")","v":""},{"$f":"'Comunicação de contratos'!B32","v":""},0,{"$f":"IF('Comunicação de contratos'!AO32=\"Incompleto\",\"Existem campos por preencher\",\"\")","v":""},0,{"$f":"IF(AND('Comunicação de contratos'!C32=\"Outras prestações de serviços\",'Comunicação de contratos'!E32=\"\"),\"Modalidade Contratual não identificada\",\"\")","v":""},0,{"$f":"IF('Comunicação de contratos'!P32>5000,\"O valor global é superior a 5 000,00€\",\"\")","v":""},0,{"$f":"IF('Comunicação de contratos'!P32<=1500,\"\",IF('Comunicação de contratos'!R32<'Comunicação de contratos'!T32,\"Redução global não foi verificada\",\"\"))","v":""},0,{"$f":"IF('Comunicação de contratos'!Y32>5000,\"O valor Mensal é superior a 5 000,00€\",\"\")","v":""},0,{"$f":"IF('Comunicação de contratos'!Y32<=1500,\"\",IF('Comunicação de contratos'!AA32<'Comunicação de contratos'!AC32,\"Redução mensal não verificada\",\"\"))","v":""},0,{"$f":"IF('Comunicação de contratos'!U32>5000,\"O valor total anual prestador é superior a 5 000,00€\",\"\")","v":""}]
[0,{"$f":"IF(A15>0,ROW('Comunicação de contratos'!B33),\"\")","v":""},{"$f":"'Comunicação de contratos'!B33","v":""},0,{"$f":"IF('Comunicação de contratos'!AO33=\"Incompleto\",\"Existem campos por preencher\",\"\")","v":""},0,{"$f":"IF(AND('Comunicação de contratos'!C33=\"Outras prestações de serviços\",'Comunicação de contratos'!E33=\"\"),\"Modalidade Contratual não identificada\",\"\")","v":""},0,{"$f":"IF('Comunicação de contratos'!P33>5000,\"O valor global é superior a 5 000,00€\",\"\")","v":""},0,{"$f":"IF('Comunicação de contratos'!P33<=1500,\"\",IF('Comunicação de contratos'!R33<'Comunicação de contratos'!T33,\"Redução global não foi verificada\",\"\"))","v":""},0,{"$f":"IF('Comunicação de contratos'!Y33>5000,\"O valor Mensal é superior a 5 000,00€\",\"\")","v":""},0,{"$f":"IF('Comunicação de contratos'!Y33<=1500,\"\",IF('Comunicação de contratos'!AA33<'Comunicação de contratos'!AC33,\"Redução mensal não verificada\",\"\"))","v":""},0,{"$f":"IF('Comunicação de contratos'!U33>5000,\"O valor total anual prestador é superior a 5 000,00€\",\"\")","v":""}]
{"$rows_left_out":16}